{"text_format":"1","workbook":"xlsx","n_sheets":2,"sheets":["証明書印刷","情報入力"],"not_rendered":{"charts":0,"images":0,"macros":1,"external_links":0,"defined_names":2,"comments":0,"pivot_tables":0},"unopened":[],"bounds":{"document_bytes":16777216,"sheet_cells":100000,"rows_first":2000,"rows_last":500,"rows_between":2000,"halvings":0,"cell_chars":16384,"cell_head_chars":4096},"cells_cut":0,"cells_raw":0,"read":"whole","date_system":"1900"}

{"sheet":"証明書印刷","index":0,"n_rows":64,"n_cols":77,"rows_kept":64,"cut":false,"hidden":false,"merged":[[0,1,1,9],[0,10,1,31],[18,37,22,50],[24,40,26,47],[24,48,26,49],[3,19,5,24],[3,6,5,15],[0,33,1,40],[3,43,5,59],[3,28,5,40],[0,72,1,79],[16,55,18,57],[19,60,20,62],[16,60,18,62],[16,63,18,64],[0,69,1,71],[12,53,14,64],[16,58,18,59],[0,60,1,67],[0,41,1,59],[3,69,5,74],[3,61,5,66],[3,76,5,81],[63,12,66,13],[63,18,66,19],[63,24,66,25],[47,15,50,27],[51,12,54,27],[44,12,46,27],[55,12,58,27],[29,48,31,49],[29,40,31,47],[21,63,23,64],[21,60,23,62],[27,40,28,47]]}
[null,null,null,null,null,null,null,null,null,null,{"$f":"IF(T4=\"\",\"\",VLOOKUP($T$4,情報入力!B3:$G$788,2,FALSE))","v":"学校総合体育大会"},null,null,null,null,null,null,null,null,null,null,null,null,null,null,null,null,null,null,null,null,null,null,null,null,null,null,null,null,null,null,{"$f":"IF(T4=\"\",\"\",VLOOKUP($T$4,情報入力!B3:$G$788,3,FALSE))","v":"剣道女子団体・剣道女子個人"}]
[]
[]
[null,null,null,null,null,null,"印刷番号",null,null,null,null,null,null,null,null,null,null,1,null,1,null,null,null,null,null,null,null,null,{"$f":"IF(T4=\"\",\"\",VLOOKUP($T$4,情報入力!B3:$G$788,4,FALSE))","v":"見本市立見本中学校"},null,null,null,null,null,null,null,null,null,null,null,null,null,null,{"$f":"IF(T4=\"\",\"\",IF(VLOOKUP($T$4,情報入力!B3:$G$788,5,FALSE)=\"\",\"\",VLOOKUP($T$4,情報入力!B3:$G$788,5,FALSE)))","v":"見本太郎"},null,null,null,null,null,null,null,null,null,null,null,null,null,null,null,null,null,{"$f":"IF(T4=\"\",\"\",IF(VLOOKUP($T$4,情報入力!B3:$G$788,6,FALSE)=\"\",\"\",VLOOKUP($T$4,情報入力!B3:$G$788,6,FALSE)))","v":29},null,null,null,null,null,null,null,{"$f":"IF(T4=\"\",\"\",IF(VLOOKUP($T$4,情報入力!B3:$X$788,7,FALSE)=\"\",\"\",VLOOKUP($T$4,情報入力!B3:$X$788,7,FALSE)))","v":7},null,null,null,null,null,null,{"$f":"IF(T4=\"\",\"\",IF(VLOOKUP($T$4,情報入力!B3:$X$788,8,FALSE)=\"\",\"\",VLOOKUP($T$4,情報入力!B3:$X$788,8,FALSE)))","v":24}]
[]
[]
[]
[]
[null,null,null,null,null,null,null,null,null,null,null,null,null,null,null,null,null,null,null,null,null,null,null,null,null,null,null,null,null,null,null,null,null,null,null,null,null,{"$f":"IF(AP1=0,AP1,AP1)","v":"剣道女子団体・剣道女子個人"}]
[null,null,null,null,null,null,null,null,null,null,null,null,null,null,null,null,null,null,null,null,null,null,null,null,null,null,null,null,null,null,null,null,null,null,null,null,null,{"$f":"IF(K1=0,K1,K1)","v":"学校総合体育大会"}]
[]
[null,null,null,null,null,null,null,null,null,null,null,null,null,null,null,null,null,null,null,null,null,null,null,null,null,null,null,null,null,null,null,null,null,null,null,null,null," 印刷をする生徒の番号\n を入力してください。"]
[]
[]
[]
[]
[]
[]
[null,null,null,null,null,null,null,null,null,null,null,null,null,null,null,null,null,null,null,null,null,null,null,null,null,null,null,null,null,null,null,null,null,null,null,null,null," 印刷をする生徒の番号\n を入力してください。"]
[]
[]
[]
[]
[]
[null,null,null,null,null,null,null,null,null,null,null,null,null,null,null,null,null,null,null,null,null,null,null,null,null,null,null,null,null,null,null,null,null,null,null,null,null,null,null,null,29,null,null,null,null,null,null,null,"番"]
[]
[]
[null,null,null,null,null,null,null,null,null,null,null,null,null,null,null,null,null,null,null,null,null,null,null,null,null,null,null,null,null,null,null,null,null,null,null,null,null,null,null,null,"～"]
[]
[null,null,null,null,null,null,null,null,null,null,null,null,null,null,null,null,null,null,null,null,null,null,null,null,null,null,null,null,null,null,null,null,null,null,null,null,null,null,null,null,38,null,null,null,null,null,null,null,"番"]
[]
[]
[]
[]
[]
[]
[]
[]
[]
[]
[]
[]
[]
[]
[null,null,null,null,null,null,null,null,null,null,null,null,{"$f":"K1","v":"学校総合体育大会"}]
[]
[]
[null,null,null,null,null,null,null,null,null,null,null,null,null,null,null,{"$f":"AP1","v":"剣道女子団体・剣道女子個人"}]
[]
[]
[]
[null,null,null,null,null,null,null,null,null,null,null,null,{"$f":"AC4","v":"見本市立見本中学校"}]
[]
[]
[]
[null,null,null,null,null,null,null,null,null,null,null,null,{"$f":"AR4","v":"見本太郎"}]
[]
[]
[]
[]
[]
[]
[]
[null,null,null,null,null,null,null,null,null,null,null,null,{"$f":"BJ4","v":29},null,null,null,null,null,{"$f":"BR4","v":7},null,null,null,null,null,{"$f":"BY4","v":24}]

{"sheet":"情報入力","index":1,"n_rows":185,"n_cols":9,"rows_kept":185,"cut":false,"hidden":false,"merged":[]}
[null,1,2,3,4,5,6]
[null,"印刷番号","大会名","競技・種目","学校名","氏名","平成","月","日"]
[null,1,"学校総合体育大会","剣道女子団体・剣道女子個人","見本市立見本中学校","見本太郎",29,7,24]
[null,2]
[null,3]
[null,4]
[null,5]
[null,6]
[null,7]
[null,8]
[null,9]
[null,10]
[null,11]
[null,12]
[null,13]
[null,14]
[null,15]
[null,16]
[null,17]
[null,18]
[null,19]
[null,20]
[null,21]
[null,22]
[null,23]
[null,24]
[null,25]
[null,26]
[null,27]
[null,28]
[null,29]
[null,30]
[null,31]
[null,32]
[null,33]
[null,34]
[null,35]
[null,36]
[null,37]
[null,38]
[null,39]
[null,40]
[null,41]
[null,42]
[null,43]
[null,44]
[null,45]
[null,46]
[null,47]
[null,48]
[null,49]
[null,50]
[null,51]
[null,52]
[null,53]
[null,54]
[null,55]
[null,56]
[null,57]
[null,58]
[null,59]
[null,60]
[null,61]
[null,62]
[null,63]
[null,64]
[null,65]
[null,66]
[null,67]
[null,68]
[null,69]
[null,70]
[null,71]
[null,72]
[null,73]
[null,74]
[null,75]
[null,76]
[null,77]
[null,78]
[null,79]
[null,80]
[null,81]
[null,82]
[null,83]
[null,84]
[null,85]
[null,86]
[null,87]
[null,88]
[null,89]
[null,90]
[null,91]
[null,92]
[null,93]
[null,94]
[null,95]
[null,96]
[null,97]
[null,98]
[null,99]
[null,100]
[null,101]
[null,102]
[null,103]
[null,104]
[null,105]
[null,106]
[null,107]
[null,108]
[null,109]
[null,110]
[null,111]
[null,112]
[null,113]
[null,114]
[null,115]
[null,116]
[null,117]
[null,118]
[null,119]
[null,120]
[null,121]
[null,122]
[null,123]
[null,124]
[null,125]
[null,126]
[null,127]
[null,128]
[null,129]
[null,130]
[null,131]
[null,132]
[null,133]
[null,134]
[null,135]
[null,136]
[null,137]
[null,138]
[null,139]
[null,140]
[null,141]
[null,142]
[null,143]
[null,144]
[null,145]
[null,146]
[null,147]
[null,148]
[null,149]
[null,150]
[null,151]
[null,152]
[null,153]
[null,154]
[null,155]
[null,156]
[null,157]
[null,158]
[null,159]
[null,160]
[null,161]
[null,162]
[null,163]
[null,164]
[null,165]
[null,166]
[null,167]
[null,168]
[null,169]
[null,170]
[null,171]
[null,172]
[null,173]
[null,174]
[null,175]
[null,176]
[null,177]
[null,178]
["",179]
[null,180]
[null,181]
["",182]
[""]